Target
Metabotropic glutamate receptor 2
Ligand
BDBM403460
Substrate
Meas. Tech.
ChEMBL_2160593 (CHEMBL5045343)
Ki
59±n/a nM
Citation
 Yuan, GDhaynaut, MLan, YGuehl, NJHuynh, DIyengar, SMAfshar, SJain, MKPickett, JEKang, HJWang, HMoon, SHOndrechen, MJWang, CShoup, TMEl Fakhri, GNormandin, MDBrownell, AL Synthesis and Characterization of 5-(2-Fluoro-4-[ J Med Chem 65:2593-2609 (2022)  
Target
Name:
Metabotropic glutamate receptor 2
Synonyms:
GPRC1B GRM2_HUMAN Metabotropic glutamate receptor mGlu2 | metabotropic glutamate 2
Type:
Enzyme
Mol. Mass.:
95584.88
Organism:
Homo sapiens (Human)
Description:
Q14416
Residue:
872
  
Inhibitor
Name:
BDBM403460
Synonyms:
US10335399, Example 2-5 | US10806724, Example 2-5
Type:
Small organic molecule
Emp. Form.:
C17H16F2N2O2
Mol. Mass.:
318.3179
SMILES:
CC1(C)CCc2c(O1)nc(cc2-c1ccc(F)cc1F)C(N)=O
: