Target
Metabotropic glutamate receptor 2
Ligand
BDBM50584759
Substrate
Meas. Tech.
ChEMBL_2160593 (CHEMBL5045343)
Ki
63±n/a nM
Citation
 Yuan, GDhaynaut, MLan, YGuehl, NJHuynh, DIyengar, SMAfshar, SJain, MKPickett, JEKang, HJWang, HMoon, SHOndrechen, MJWang, CShoup, TMEl Fakhri, GNormandin, MDBrownell, AL Synthesis and Characterization of 5-(2-Fluoro-4-[ J Med Chem 65:2593-2609 (2022)  
Target
Name:
Metabotropic glutamate receptor 2
Synonyms:
GPRC1B GRM2_HUMAN Metabotropic glutamate receptor mGlu2 | metabotropic glutamate 2
Type:
Enzyme
Mol. Mass.:
95584.88
Organism:
Homo sapiens (Human)
Description:
Q14416
Residue:
872
  
Inhibitor
Name:
BDBM50584759
Synonyms:
CHEMBL5089623
Type:
Small organic molecule
Emp. Form.:
C18H19FN2O3
Mol. Mass.:
330.3535
SMILES:
COc1ccc(c(F)c1)-c1cc(nc2OC(C)(C)CCc12)C(N)=O
: