Target
Cytochrome P450 3A7
Ligand
BDBM50584760
Substrate
Meas. Tech.
ChEMBL_2160657 (CHEMBL5045407)
IC50
64780±n/a nM
Citation
 Tu, DNing, JZou, LWang, PZhang, YTian, XZhang, FZheng, JGe, G Unique Oxidative Metabolism of Bufalin Generates Two Reactive Metabolites That Strongly Inactivate Human Cytochrome P450 3A. J Med Chem 65:4018-4029 (2022)  
Target
Name:
Cytochrome P450 3A7
Synonyms:
1.14.14.1 CYP3A7 Cytochrome P450 3A7 P450HLp2
Type:
PROTEIN
Mol. Mass.:
57485.39
Organism:
Homo sapiens
Description:
ChEMBL_109496
Residue:
503
  
Inhibitor
Name:
BDBM50584760
Synonyms:
CHEMBL2068968
Type:
Small organic molecule
Emp. Form.:
C24H32O4
Mol. Mass.:
384.5085
SMILES:
[H][C@]12CC[C@]3([H])[C@]([H])(CC[C@]4(C)[C@H](CC[C@]34O)c3ccc(=O)oc3)[C@@]1(C)CCC(=O)C2
: