Target
P2Y purinoceptor 14
Ligand
BDBM50584891
Substrate
Meas. Tech.
ChEMBL_2160851 (CHEMBL5045601)
IC50
3.11±n/a nM
Citation
 Wen, ZSalmaso, VJung, YHPhung, NBGopinatth, VShah, QPatterson, ATRandle, JCRChen, ZSalvemini, DLieberman, DIWhitehead, GSKarcz, TPCook, DNJacobson, KA Bridged Piperidine Analogues of a High Affinity Naphthalene-Based P2Y J Med Chem 65:3434-3459 (2022)  
Target
Name:
P2Y purinoceptor 14
Synonyms:
GPR105 KIAA0001 P2Y14_HUMAN | Purinergic receptor P2Y14
Type:
PROTEIN
Mol. Mass.:
38991.62
Organism:
Homo sapiens (Human)
Description:
ChEMBL_1502487
Residue:
338
  
Inhibitor
Name:
BDBM50584891
Synonyms:
CHEMBL5085823
Type:
Small organic molecule
Emp. Form.:
C30H24F3NO2
Mol. Mass.:
487.5123
SMILES:
[H][C@@]12C[C@H](c3ccc(cc3)-c3cc(cc4cc(ccc34)-c3ccc(cc3)C(F)(F)F)C(O)=O)[C@@]([H])(CN1)C2
: