Target
Mitogen-activated protein kinase 14
Ligand
BDBM50153824
Substrate
Meas. Tech.
ChEMBL_305841 (CHEMBL829582)
IC50
230±n/a nM
Citation
 Brown, DSBelfield, AJBrown, GRCampbell, DFoubister, AMasters, DJPike, KGSnelson, WLWells, SL A novel series of p38 MAP kinase inhibitors for the potential treatment of rheumatoid arthritis. Bioorg Med Chem Lett 14:5383-7 (2004)  
Target
Name:
Mitogen-activated protein kinase 14
Synonyms:
CSAID-binding protein CSBP1 CSPB1 MAP kinase 14 MAP kinase p38 alpha MAPK14 MK14_HUMAN Mitogen-activated protein kinase p38 alpha Stress-activated protein kinase 2a | p38 MAP kinase alpha/beta
Type:
Serine/threonine-protein kinase
Mol. Mass.:
41286.76
Organism:
Homo sapiens (Human)
Description:
Q16539
Residue:
360
  
Inhibitor
Name:
BDBM50153824
Synonyms:
CHEMBL186542 | N-[5-(3-Dimethylamino-benzoylamino)-2-methyl-phenyl]-3,4,5-trimethoxy-benzamide
Type:
Small organic molecule
Emp. Form.:
C26H29N3O5
Mol. Mass.:
463.5256
SMILES:
COc1cc(cc(OC)c1OC)C(=O)Nc1cc(NC(=O)c2cccc(c2)N(C)C)ccc1C
: