Target
Mitogen-activated protein kinase 14
Ligand
BDBM50153834
Substrate
Meas. Tech.
ChEMBL_305841 (CHEMBL829582)
IC50
60±n/a nM
Citation
 Brown, DSBelfield, AJBrown, GRCampbell, DFoubister, AMasters, DJPike, KGSnelson, WLWells, SL A novel series of p38 MAP kinase inhibitors for the potential treatment of rheumatoid arthritis. Bioorg Med Chem Lett 14:5383-7 (2004)  
Target
Name:
Mitogen-activated protein kinase 14
Synonyms:
CSAID-binding protein CSBP1 CSPB1 MAP kinase 14 MAP kinase p38 alpha MAPK14 MK14_HUMAN Mitogen-activated protein kinase p38 alpha Stress-activated protein kinase 2a | p38 MAP kinase alpha/beta
Type:
Serine/threonine-protein kinase
Mol. Mass.:
41286.76
Organism:
Homo sapiens (Human)
Description:
Q16539
Residue:
360
  
Inhibitor
Name:
BDBM50153834
Synonyms:
1-(3-dimethylaminophenylcarboxamido)-3-(4-ethoxyphenylcarboxamido)-4-methylbenzene | CHEMBL185448
Type:
Small organic molecule
Emp. Form.:
C25H27N3O3
Mol. Mass.:
417.5002
SMILES:
CCOc1ccc(cc1)C(=O)Nc1cc(NC(=O)c2cccc(c2)N(C)C)ccc1C
: