Target
Calcium/calmodulin-dependent protein kinase type 1B
Ligand
BDBM50585045
Substrate
Meas. Tech.
ChEMBL_2161408 (CHEMBL5046158)
IC50
830±n/a nM
Citation
 Powell, CEHatcher, JMJiang, JVatsan, PSChe, JGray, NS Selective Macrocyclic Inhibitors of DYRK1A/B. ACS Med Chem Lett 13:577-585 (2022)  
Target
Name:
Calcium/calmodulin-dependent protein kinase type 1B
Synonyms:
CaM kinase I beta CaM-KI beta Calcium/calmodulin-dependent protein kinase type 1B PNCK | Pregnancy up-regulated non-ubiquitously-expressed CaM kinase
Type:
PROTEIN
Mol. Mass.:
38501.47
Organism:
Homo sapiens (Human)
Description:
ChEMBL_109914
Residue:
343
  
Inhibitor
Name:
BDBM50585045
Synonyms:
CHEMBL5093741
Type:
Small organic molecule
Emp. Form.:
C22H19F3N8O
Mol. Mass.:
468.4345
SMILES:
CN1Cc2nn(C)c(C#N)c2-c2cnc3[nH]cc(-c4cn(CCCC1=O)nc4C(F)(F)F)c3c2
: