Target
5-hydroxytryptamine receptor 2A
Ligand
BDBM50585206
Substrate
Meas. Tech.
ChEMBL_2161776 (CHEMBL5046637)
Ki
0.245471±n/a nM
Citation
 Marcinkowska, MBucki, ASniecikowska, JZagórska, AFajkis-Zaj?czkowska, NSiwek, AGluch-Lutwin, M?mudzki, PJastrzebska-Wiesek, MPartyka, AWeso?owska, AAbram, MPrzejczowska-Pomierny, KCios, AWyska, EMika, KKota?ska, MMierzejewski, PKolaczkowski, M Multifunctional Arylsulfone and Arylsulfonamide-Based Ligands with Prominent Mood-Modulating Activity and Benign Safety Profile, Targeting Neuropsychiatric Symptoms of Dementia. J Med Chem 64:12603-12629 (2021)  
Target
Name:
5-hydroxytryptamine receptor 2A
Synonyms:
5-HT-2 5-HT2A 5-hydroxytryptamine receptor 2A (5HT-2A) 5HT2A_HUMAN HTR2A | Serotonin receptor 2A
Type:
undefined
Mol. Mass.:
52607.65
Organism:
Homo sapiens (Human)
Description:
P28223
Residue:
471
  
Inhibitor
Name:
BDBM50585206
Synonyms:
CHEMBL5084167
Type:
Small organic molecule
Emp. Form.:
C25H25FN2O3S
Mol. Mass.:
452.541
SMILES:
Fc1ccc2c(CCCN3CCC(CS(=O)(=O)c4ccc5ccccc5c4)C3)noc2c1
: