Target
5-hydroxytryptamine receptor 7
Ligand
BDBM78940
Substrate
Meas. Tech.
ChEMBL_2161778 (CHEMBL5046639)
Ki
0.562341±n/a nM
Citation
 Marcinkowska, MBucki, ASniecikowska, JZagórska, AFajkis-Zaj?czkowska, NSiwek, AGluch-Lutwin, M?mudzki, PJastrzebska-Wiesek, MPartyka, AWeso?owska, AAbram, MPrzejczowska-Pomierny, KCios, AWyska, EMika, KKota?ska, MMierzejewski, PKolaczkowski, M Multifunctional Arylsulfone and Arylsulfonamide-Based Ligands with Prominent Mood-Modulating Activity and Benign Safety Profile, Targeting Neuropsychiatric Symptoms of Dementia. J Med Chem 64:12603-12629 (2021)  
Target
Name:
5-hydroxytryptamine receptor 7
Synonyms:
5-HT-7 5-HT7 5-HT7S 5HT7 HTR7 | Serotonin receptor 7
Type:
G Protein-Coupled Receptor (GPCR)
Mol. Mass.:
53573.08
Organism:
Homo sapiens (Human)
Description:
P34969
Residue:
479
  
Inhibitor
Name:
BDBM78940
Synonyms:
METHIOTHEPIN Methiothepin mesylate salt cid_3039995 methanesulfonic acid;1-methyl-4-(3-methylsulfanyl-5,6-dihydrobenzo[b][1]benzothiepin-5-yl)piperazine | methanesulfonic acid;1-methyl-4-[3-(methylthio)-5,6-dihydrobenzo[b][1]benzothiepin-5-yl]piperazine
Type:
Small organic molecule
Emp. Form.:
C20H24N2S2
Mol. Mass.:
356.548
SMILES:
CSc1ccc2Sc3ccccc3CC(N3CCN(C)CC3)c2c1
: