Target
Tyrosine-protein kinase JAK1
Ligand
BDBM50585510
Substrate
Meas. Tech.
ChEMBL_2162565 (CHEMBL5047426)
IC50
1.6±n/a nM
Citation
 Wellaway, CRBaldwin, IRBamborough, PBarker, DBartholomew, MAChung, CWDümpelfeld, BEvans, JPFazakerley, NJHomes, PKeeling, SPLewell, XQMcNab, FWMorley, JNeedham, DNeu, Mvan Oosterhout, AJMPal, AReinhard, FBMRianjongdee, FRobertson, CMRowland, PShah, RRSherriff, EBSloan, LATeague, SThomas, DAWellaway, NWojno-Picon, JWoolven, JMCoe, DM Investigation of Janus Kinase (JAK) Inhibitors for Lung Delivery and the Importance of Aldehyde Oxidase Metabolism. J Med Chem 65:633-664 (2022)  
Target
Name:
Tyrosine-protein kinase JAK1
Synonyms:
JAK-1 JAK1A JAK1_HUMAN Janus kinase 1 (JAK1) | Janus kinase 1 JAK1
Type:
Protein
Mol. Mass.:
133293.73
Organism:
Homo sapiens (Human)
Description:
P23458
Residue:
1154
  
Inhibitor
Name:
BDBM50585510
Synonyms:
CHEMBL5076068
Type:
Small organic molecule
Emp. Form.:
C19H22FN5O
Mol. Mass.:
355.4093
SMILES:
CCc1cc(O)c(F)cc1-c1cc(NCCNC)c2nc(N)ncc2c1
: