Target
Tyrosine-protein kinase JAK3
Ligand
BDBM50585509
Substrate
Meas. Tech.
ChEMBL_2162567 (CHEMBL5047428)
IC50
1.6±n/a nM
Citation
 Wellaway, CRBaldwin, IRBamborough, PBarker, DBartholomew, MAChung, CWDümpelfeld, BEvans, JPFazakerley, NJHomes, PKeeling, SPLewell, XQMcNab, FWMorley, JNeedham, DNeu, Mvan Oosterhout, AJMPal, AReinhard, FBMRianjongdee, FRobertson, CMRowland, PShah, RRSherriff, EBSloan, LATeague, SThomas, DAWellaway, NWojno-Picon, JWoolven, JMCoe, DM Investigation of Janus Kinase (JAK) Inhibitors for Lung Delivery and the Importance of Aldehyde Oxidase Metabolism. J Med Chem 65:633-664 (2022)  
Target
Name:
Tyrosine-protein kinase JAK3
Synonyms:
JAK-3 JAK3_HUMAN Janus kinase 3 (JAK3) L-JAK | Leukocyte janus kinase
Type:
Protein
Mol. Mass.:
125111.08
Organism:
Homo sapiens (Human)
Description:
P52333
Residue:
1124
  
Inhibitor
Name:
BDBM50585509
Synonyms:
CHEMBL5085176
Type:
Small organic molecule
Emp. Form.:
C19H21FN4O3
Mol. Mass.:
372.3934
SMILES:
CCc1cc(O)c(F)cc1-c1cc(NC(CO)CO)c2nc(N)ncc2c1
: