Target
Lysine-specific histone demethylase 1A
Ligand
BDBM50586369
Substrate
Meas. Tech.
ChEMBL_2168532 (CHEMBL5053591)
Ki
5.3±n/a nM
Citation
 Kitagawa, HKikuchi, MSato, SWatanabe, HUmezawa, NKato, MHisamatsu, YUmehara, THiguchi, T Structure-Based Identification of Potent Lysine-Specific Demethylase 1 Inhibitor Peptides and Temporary Cyclization to Enhance Proteolytic Stability and Cell Growth-Inhibitory Activity. J Med Chem 64:3707-3719 (2021)  
Target
Name:
Lysine-specific histone demethylase 1A
Synonyms:
AOF2 Flavin-containing amine oxidase domain-containing protein 2 KDM1A KIAA0601 Lysine-specific demethylase 1 (LSD1) Lysine-specific histone demethylase 1 (LSD1)
Type:
Enzyme
Mol. Mass.:
92901.01
Organism:
Homo sapiens (Human)
Description:
O60341
Residue:
852
  
Inhibitor
Name:
BDBM50586369
Synonyms:
CHEMBL5094265
Type:
Small organic molecule
Emp. Form.:
C52H91N21O11
Mol. Mass.:
1186.413
SMILES:
CC(C)C[C@H](NC(=O)[C@H](Cc1ccccc1)NC(=O)[C@H](CO)NC(=O)[C@H](CCCNC(N)=N)NC(=O)[C@@H]1CCCN1)C(=O)N[C@@H](C(C)C)C(=O)N[C@@H](CCCNC(N)=N)C(=O)N[C@@H](CCCNC(N)=N)C(=O)N[C@@H](CCCNC(N)=N)C(O)=O
: