Target
Thyrotropin-releasing hormone receptor
Ligand
BDBM50072394
Substrate
Meas. Tech.
ChEMBL_303571 (CHEMBL828971)
Ki
42±n/a nM
Citation
 Prokai, LProkai-Tatrai, KZharikova, ADNguyen, VPerjesi, PStevens, SM Centrally acting and metabolically stable thyrotropin-releasing hormone analogues by replacement of histidine with substituted pyridinium. J Med Chem 47:6025-33 (2004)  
Target
Name:
Thyrotropin-releasing hormone receptor
Synonyms:
TRH-R Thyroliberin receptor | Trhr
Type:
PROTEIN
Mol. Mass.:
46618.79
Organism:
Rattus norvegicus
Description:
ChEMBL_303571
Residue:
412
  
Inhibitor
Name:
BDBM50072394
Synonyms:
1-[3-(1H-4-imidazolyl)-2-(5-oxotetrahydro-1H-2-pyrrolylcarboxamido)propanoyl]tetrahydro-1H-2-pyrrolecarboxamide ABBOTT-38579 | PROTIRELIN
Type:
Small organic molecule
Emp. Form.:
C16H22N6O4
Mol. Mass.:
362.3837
SMILES:
NC(=O)[C@@H]1CCCN1C(=O)[C@H](Cc1cnc[nH]1)NC(=O)[C@@H]1CCC(=O)N1
: