Target
Neuropeptide Y receptor type 1
Ligand
BDBM50156318
Substrate
Meas. Tech.
ChEMBL_305666 (CHEMBL827935)
IC50
4±n/a nM
Citation
 Luo, GMattson, GKBruce, MAWong, HMurphy, BJLonghi, DAntal-Zimanyi, IPoindexter, GS Isosteric N-arylpiperazine replacements in a series of dihydropyridine NPY1 receptor antagonists. Bioorg Med Chem Lett 14:5975-8 (2004)  
Target
Name:
Neuropeptide Y receptor type 1
Synonyms:
NPY-Y1 NPY1R NPYR neuropeptide Y receptor Y1
Type:
Enzyme Catalytic Domain
Mol. Mass.:
44399.07
Organism:
Homo sapiens (Human)
Description:
NPY-Y1 NPY1R HUMAN::P25929
Residue:
384
  
Inhibitor
Name:
BDBM50156318
Synonyms:
CHEMBL361273 | N-arylpiperazine derivative
Type:
Small organic molecule
Emp. Form.:
C33H41N7O4
Mol. Mass.:
599.7231
SMILES:
COC(=O)C1C(C(C(=O)OC)=C(C)N=C1C)c1cccc(NC(NCCNC2CCN(CC2)c2ccccc2C)=NC#N)c1
: