Target
Sodium channel protein type 5 subunit alpha
Ligand
BDBM145635
Substrate
Meas. Tech.
ChEMBL_2170559 (CHEMBL5055693)
IC50
1100±n/a nM
Target
Name:
Sodium channel protein type 5 subunit alpha
Synonyms:
HH1 SCN5A_HUMAN Sodium channel protein type 5 subunit alpha/beta-1/beta-2 Voltage-gated sodium channel subunit alpha Nav1.5
Type:
Enzyme
Mol. Mass.:
226908.60
Organism:
Homo sapiens (Human)
Description:
Q14524
Residue:
2016
  
Inhibitor
Name:
BDBM145635
Synonyms:
US8952169, 440
Type:
Small organic molecule
Emp. Form.:
C28H29FN2O4S
Mol. Mass.:
508.604
SMILES:
CS(=O)(=O)NC(=O)c1cc(C2CC2)c(OCC2CN(C2)C(c2ccccc2)c2ccccc2)cc1F
: