Target
Neuronal acetylcholine receptor subunit alpha-7
Ligand
BDBM50587086
Substrate
Meas. Tech.
ChEMBL_2170854 (CHEMBL5055988)
IC50
6.0±n/a nM
Citation
 Wang, SZhu, XZhangsun, MWu, YYu, JHarvey, PJKaas, QZhangsun, DCraik, DJLuo, S Engineered Conotoxin Differentially Blocks and Discriminates Rat and Human ?7 Nicotinic Acetylcholine Receptors. J Med Chem 64:5620-5631 (2021)  
Target
Name:
Neuronal acetylcholine receptor subunit alpha-7
Synonyms:
ACHA7_RAT Cholinergic, Nicotinic Alpha7 Chrna7 Neuronal acetylcholine receptor (alpha7 nAChR) Neuronal acetylcholine receptor subunit alpha-7 Neuronal acetylcholine receptor subunit alpha-7 (nAChR)
Type:
Enzyme
Mol. Mass.:
56502.44
Organism:
Rattus norvegicus (Rat)
Description:
Q05941
Residue:
502
  
Inhibitor
Name:
BDBM50587086
Synonyms:
CHEMBL5076977
Type:
Small organic molecule
Emp. Form.:
C101H168N42O31S4
Mol. Mass.:
2594.937
SMILES:
CC[C@H](C)[C@H](N)C(=O)N[C@@H](CCCNC(N)=N)C(=O)N[C@@H](CC(O)=O)C(=O)N[C@@H](CCC(O)=O)C(=O)N[C@H]1CSSC[C@H]2NC(=O)[C@H](C)NC(=O)[C@@H]3CCCN3C(=O)[C@H](CC(N)=O)NC(=O)[C@H](CO)NC(=O)[C@H](CSSC[C@H](NC(=O)[C@@H](NC(=O)[C@H](Cc3cnc[nH]3)NC(=O)[C@@H]3CCCN3C(=O)[C@H](CC(N)=O)NC(=O)[C@H](CC(N)=O)NC(=O)[C@@H](NC(=O)[C@H](CCCNC(N)=N)NC2=O)C(C)C)C(C)C)C(=O)N[C@@H](CCCNC(N)=N)C(=O)N[C@@H](CCCNC(N)=N)C(=O)N[C@@H](CCCNC(N)=N)C(O)=O)NC1=O
: