Target
Neuronal acetylcholine receptor subunit alpha-3/beta-2
Ligand
BDBM50516336
Substrate
Meas. Tech.
ChEMBL_2170856 (CHEMBL5055990)
IC50
11±n/a nM
Citation
 Wang, SZhu, XZhangsun, MWu, YYu, JHarvey, PJKaas, QZhangsun, DCraik, DJLuo, S Engineered Conotoxin Differentially Blocks and Discriminates Rat and Human ?7 Nicotinic Acetylcholine Receptors. J Med Chem 64:5620-5631 (2021)  
Target
Name:
Neuronal acetylcholine receptor subunit alpha-3/beta-2
Synonyms:
Neuronal acetylcholine receptor Alpha-3/Beta-2 Neuronal acetylcholine receptor; alpha3/beta2 | nAChR subtypes alpha3 beta2
Type:
Protein
Mol. Mass.:
Description:
Components:
This complex has 2 components.
Component 1
Name:
Neuronal acetylcholine receptor subunit alpha-3
Synonyms:
ACHA3_RAT Chrna3
Type:
Enzyme
Mol. Mass.:
56995.52
Organism:
Rattus norvegicus (Rat)
Description:
P04757
Residue:
499
  
Component 2
Name:
Neuronal acetylcholine receptor subunit beta-2
Synonyms:
ACHB2_RAT Chrnb2 Neuronal acetylcholine receptor non-alpha-1 chain
Type:
Enzyme
Mol. Mass.:
56910.32
Organism:
Rattus norvegicus (Rat)
Description:
P12390
Residue:
500
  
Inhibitor
Name:
BDBM50516336
Synonyms:
CHEMBL4465982
Type:
Small organic molecule
Emp. Form.:
C67H101N25O21S4
Mol. Mass.:
1720.934
SMILES:
CC[C@H](C)[C@@H]1NC(=O)[C@H](Cc2cnc[nH]2)NC(=O)[C@@H]2CCCN2C(=O)[C@H](CC(N)=O)NC(=O)[C@H](CC(N)=O)NC(=O)[C@@H](NC(=O)[C@H](CC(N)=O)NC(=O)[C@@H]2CSSC[C@H](NC(=O)CN)C(=O)N[C@@H](CSSC[C@H](NC1=O)C(=O)NCC(N)=O)C(=O)N[C@@H](CO)C(=O)N[C@@H](Cc1cnc[nH]1)C(=O)N1CCC[C@H]1C(=O)N[C@@H](C)C(=O)N2)C(C)C
: