Target
Neuronal acetylcholine receptor subunit alpha-3/beta-4
Ligand
BDBM50587095
Substrate
Meas. Tech.
ChEMBL_2170911 (CHEMBL5056045)
IC50
3.0±n/a nM
Citation
 Wang, SZhu, XZhangsun, MWu, YYu, JHarvey, PJKaas, QZhangsun, DCraik, DJLuo, S Engineered Conotoxin Differentially Blocks and Discriminates Rat and Human ?7 Nicotinic Acetylcholine Receptors. J Med Chem 64:5620-5631 (2021)  
Target
Name:
Neuronal acetylcholine receptor subunit alpha-3/beta-4
Synonyms:
Neuronal acetylcholine receptor Alpha-3/Beta-4 Neuronal acetylcholine receptor; alpha3/beta4 | nAChR subtypes alpha3 beta4
Type:
Protein
Mol. Mass.:
Description:
Components:
This complex has 2 components.
Component 1
Name:
Neuronal acetylcholine receptor subunit alpha-3
Synonyms:
ACHA3_RAT Chrna3
Type:
Enzyme
Mol. Mass.:
56995.52
Organism:
Rattus norvegicus (Rat)
Description:
P04757
Residue:
499
  
Component 2
Name:
Neuronal acetylcholine receptor subunit beta-4
Synonyms:
ACHB4_RAT Chrnb4 Neuronal acetylcholine receptor non-alpha-2 chain | Neuronal acetylcholine receptor protein beta-4 subunit
Type:
Enzyme
Mol. Mass.:
55863.89
Organism:
Rattus norvegicus (Rat)
Description:
P12392
Residue:
495
  
Inhibitor
Name:
BDBM50587095
Synonyms:
CHEMBL5084339
Type:
Small organic molecule
Emp. Form.:
C89H145N37O29S4
Mol. Mass.:
2325.594
SMILES:
CC(C)[C@@H]1NC(=O)[C@H](CCCNC(N)=N)NC(=O)[C@@H]2CSSC[C@H](NC(=O)[C@H](CCC(O)=O)NC(=O)[C@@H](N)CC(O)=O)C(=O)N[C@@H](CSSC[C@H](NC(=O)[C@@H](NC(=O)[C@H](Cc3cnc[nH]3)NC(=O)[C@@H]3CCCN3C(=O)[C@H](CC(N)=O)NC(=O)[C@H](CC(N)=O)NC1=O)C(C)C)C(=O)N[C@@H](CCCNC(N)=N)C(=O)N[C@@H](CCCNC(N)=N)C(=O)N[C@@H](CCCNC(N)=N)C(O)=O)C(=O)N[C@@H](CO)C(=O)N[C@@H](CC(N)=O)C(=O)N1CCC[C@H]1C(=O)N[C@@H](C)C(=O)N2
: