Target
Neuronal acetylcholine receptor subunit alpha-3/alpha-6/beta-4
Ligand
BDBM50587096
Substrate
Meas. Tech.
ChEMBL_2170913 (CHEMBL5056047)
IC50
12±n/a nM
Citation
 Wang, SZhu, XZhangsun, MWu, YYu, JHarvey, PJKaas, QZhangsun, DCraik, DJLuo, S Engineered Conotoxin Differentially Blocks and Discriminates Rat and Human ?7 Nicotinic Acetylcholine Receptors. J Med Chem 64:5620-5631 (2021)  
Target
Name:
Neuronal acetylcholine receptor subunit alpha-3/alpha-6/beta-4
Synonyms:
Nicotinic acetylcholine receptor alpha6/alpha3/beta4
Type:
Mol. Mass.:
Description:
ASSAY_ID of ChEMBL is 2103199
Components:
This complex has 3 components.
Component 1
Name:
Neuronal acetylcholine receptor subunit beta-4
Synonyms:
ACHB4_HUMAN Cholinergic, Nicotinic Alpha6Beta3Beta4Alpha5 Nicotinic acetylcholine receptor alpha6/alpha3/beta4
Type:
Enzyme Catalytic Domain
Mol. Mass.:
56388.51
Organism:
Homo sapiens (Human)
Description:
Cholinergic, Nicotinic Alpha6Beta3Beta4Alpha5 0 HUMAN::P30926
Residue:
498
  
Component 2
Name:
Neuronal acetylcholine receptor subunit alpha-3
Synonyms:
ACHA3_HUMAN Cholinergic, Nicotinic Alpha3Beta2 Cholinergic, Nicotinic Alpha3Beta4x NACHRA3 Neuronal acetylcholine receptor subunit alpha-3 nicotinic central
Type:
Enzyme Catalytic Domain
Mol. Mass.:
57479.03
Organism:
Homo sapiens (Human)
Description:
Cholinergic, Nicotinic Alpha3Beta2 0 HUMAN::P32297
Residue:
505
  
Component 3
Name:
Neuronal acetylcholine receptor subunit alpha-6
Synonyms:
ACHA6_HUMAN Neuronal acetylcholine receptor protein alpha-6 subunit
Type:
PROTEIN
Mol. Mass.:
56898.54
Organism:
Homo sapiens (Human)
Description:
EBI_12774
Residue:
494
  
Inhibitor
Name:
BDBM50587096
Synonyms:
CHEMBL5086388
Type:
Small organic molecule
Emp. Form.:
C56H84N14O19S4
Mol. Mass.:
1385.609
SMILES:
CC(C)C[C@@H]1NC(=O)[C@@H](NC(=O)[C@H](C)NC(=O)[C@@H]2CSSC[C@H](NC(=O)CN)C(=O)N[C@@H](CSSC[C@@H](NC(=O)[C@H](Cc3ccc(O)cc3)NC1=O)C(=O)NCC(O)=O)C(=O)N[C@@H](CO)C(=O)N[C@@H]([C@@H](C)O)C(=O)N1CC(O)C[C@H]1C(=O)N1CCC[C@H]1C(=O)N2)C(C)C
: