Target
Adenosine receptor A1
Ligand
BDBM50157673
Substrate
Meas. Tech.
ChEMBL_430067 (CHEMBL918669)
Ki
3.7±n/a nM
Citation
 Chang, LCSpanjersberg, RFvon Frijtag Drabbe Künzel, JKMulder-Krieger, Tvan den Hout, GBeukers, MWBrussee, JIjzerman, AP 2,4,6-trisubstituted pyrimidines as a new class of selective adenosine A1 receptor antagonists. J Med Chem 47:6529-40 (2004)  
Target
Name:
Adenosine receptor A1
Synonyms:
A1 adenosine receptor (hA1) AA1R_HUMAN ADORA1 Adenosine A1-receptor Adenosine receptor A1 (hA1) | Adenosine transporter (AdT)
Type:
G Protein-Coupled Receptor (GPCR)
Mol. Mass.:
36520.92
Organism:
Homo sapiens (Human)
Description:
P30542
Residue:
326
  
Inhibitor
Name:
BDBM50157673
Synonyms:
CHEMBL222719 N-(4,6-diphenylpyrimidin-2-yl)butyramide
Type:
Small organic molecule
Emp. Form.:
C20H19N3O
Mol. Mass.:
317.3844
SMILES:
CCCC(=O)Nc1nc(cc(n1)-c1ccccc1)-c1ccccc1
: