Target
5-hydroxytryptamine receptor 6
Ligand
BDBM50158047
Substrate
Meas. Tech.
ChEMBL_303182 (CHEMBL829676)
Ki
2±n/a nM
Citation
 Cole, DCEllingboe, JWLennox, WJMazandarani, HSmith, DLStock, JRZhang, GZhou, PSchechter, LE N1-arylsulfonyl-3-(1,2,3,6-tetrahydropyridin-4-yl)-1H-indole derivatives are potent and selective 5-HT6 receptor antagonists. Bioorg Med Chem Lett 15:379-83 (2004)  
Target
Name:
5-hydroxytryptamine receptor 6
Synonyms:
5-HT-6 5-hydroxytryptamine receptor 6 (5-HT-6) 5-hydroxytryptamine receptor 6 (5HT6) HTR6 Serotonin 6 (5-HT6) receptor | Serotonin Receptor 6
Type:
G Protein-Coupled Receptor (GPCR)
Mol. Mass.:
46968.43
Organism:
Homo sapiens (Human)
Description:
P50406
Residue:
440
  
Inhibitor
Name:
BDBM50158047
Synonyms:
4-(5-Fluoro-3-piperidin-4-yl-indole-1-sulfonyl)-phenylamine | CHEMBL178385
Type:
Small organic molecule
Emp. Form.:
C19H20FN3O2S
Mol. Mass.:
373.444
SMILES:
Nc1ccc(cc1)S(=O)(=O)n1cc(C2CCNCC2)c2cc(F)ccc12
: