Target
Glycogen phosphorylase, liver form
Ligand
BDBM50158264
Substrate
Meas. Tech.
ChEMBL_304931 (CHEMBL826961)
IC50
96±n/a nM
Citation
 Wright, SWRath, VLGenereux, PEHageman, DLLevy, CBMcClure, LDMcCoid, SCMcPherson, RKSchelhorn, TMWilder, DEZavadoski, WJGibbs, EMTreadway, JL 5-Chloroindoloyl glycine amide inhibitors of glycogen phosphorylase: synthesis, in vitro, in vivo, and X-ray crystallographic characterization. Bioorg Med Chem Lett 15:459-65 (2004)  
Target
Name:
Glycogen phosphorylase, liver form
Synonyms:
Glycogen Phosphorylase (PYGL) Liver glycogen phosphorylase PYGL_HUMAN
Type:
Homodimer
Mol. Mass.:
97153.98
Organism:
Homo sapiens (Human)
Description:
Dimers associate into a tetramer to form the enzymatically active phosphorylase A.
Residue:
847
  
Inhibitor
Name:
BDBM50158264
Synonyms:
5-Chloro-1H-indole-2-carboxylic acid [(allyl-cyclopentyl-carbamoyl)-methyl]-amide | CHEMBL181456
Type:
Small organic molecule
Emp. Form.:
C19H22ClN3O2
Mol. Mass.:
359.85
SMILES:
Clc1ccc2[nH]c(cc2c1)C(=O)NCC(=O)N(CC=C)C1CCCC1
: