Target
Glycogen phosphorylase, liver form
Ligand
BDBM50158298
Substrate
Meas. Tech.
ChEMBL_304931 (CHEMBL826961)
IC50
250±n/a nM
Citation
 Wright, SWRath, VLGenereux, PEHageman, DLLevy, CBMcClure, LDMcCoid, SCMcPherson, RKSchelhorn, TMWilder, DEZavadoski, WJGibbs, EMTreadway, JL 5-Chloroindoloyl glycine amide inhibitors of glycogen phosphorylase: synthesis, in vitro, in vivo, and X-ray crystallographic characterization. Bioorg Med Chem Lett 15:459-65 (2004)  
Target
Name:
Glycogen phosphorylase, liver form
Synonyms:
Glycogen Phosphorylase (PYGL) Liver glycogen phosphorylase PYGL_HUMAN
Type:
Homodimer
Mol. Mass.:
97153.98
Organism:
Homo sapiens (Human)
Description:
Dimers associate into a tetramer to form the enzymatically active phosphorylase A.
Residue:
847
  
Inhibitor
Name:
BDBM50158298
Synonyms:
5-Chloro-1H-indole-2-carboxylic acid {[(1-formyl-pyrrolidin-3-yl)-methyl-carbamoyl]-methyl}-amide | CHEMBL178569
Type:
Small organic molecule
Emp. Form.:
C17H19ClN4O3
Mol. Mass.:
362.811
SMILES:
CN(C1CCN(C1)C=O)C(=O)CNC(=O)c1cc2cc(Cl)ccc2[nH]1
: