Target
Glycogen phosphorylase, liver form
Ligand
BDBM50158245
Substrate
Meas. Tech.
ChEMBL_304931 (CHEMBL826961)
IC50
55.0±n/a nM
Citation
 Wright, SWRath, VLGenereux, PEHageman, DLLevy, CBMcClure, LDMcCoid, SCMcPherson, RKSchelhorn, TMWilder, DEZavadoski, WJGibbs, EMTreadway, JL 5-Chloroindoloyl glycine amide inhibitors of glycogen phosphorylase: synthesis, in vitro, in vivo, and X-ray crystallographic characterization. Bioorg Med Chem Lett 15:459-65 (2004)  
Target
Name:
Glycogen phosphorylase, liver form
Synonyms:
Glycogen Phosphorylase (PYGL) Liver glycogen phosphorylase PYGL_HUMAN
Type:
Homodimer
Mol. Mass.:
97153.98
Organism:
Homo sapiens (Human)
Description:
Dimers associate into a tetramer to form the enzymatically active phosphorylase A.
Residue:
847
  
Inhibitor
Name:
BDBM50158245
Synonyms:
5-Chloro-1H-indole-2-carboxylic acid {[(2-hydroxy-ethyl)-(tetrahydro-furan-3-yl)-carbamoyl]-methyl}-amide | CHEMBL181737
Type:
Small organic molecule
Emp. Form.:
C17H20ClN3O4
Mol. Mass.:
365.811
SMILES:
OCCN(C1CCOC1)C(=O)CNC(=O)c1cc2cc(Cl)ccc2[nH]1
: