Target
Glycogen phosphorylase, liver form
Ligand
BDBM50158255
Substrate
Meas. Tech.
ChEMBL_304931 (CHEMBL826961)
IC50
30±n/a nM
Citation
 Wright, SWRath, VLGenereux, PEHageman, DLLevy, CBMcClure, LDMcCoid, SCMcPherson, RKSchelhorn, TMWilder, DEZavadoski, WJGibbs, EMTreadway, JL 5-Chloroindoloyl glycine amide inhibitors of glycogen phosphorylase: synthesis, in vitro, in vivo, and X-ray crystallographic characterization. Bioorg Med Chem Lett 15:459-65 (2004)  
Target
Name:
Glycogen phosphorylase, liver form
Synonyms:
Glycogen Phosphorylase (PYGL) Liver glycogen phosphorylase PYGL_HUMAN
Type:
Homodimer
Mol. Mass.:
97153.98
Organism:
Homo sapiens (Human)
Description:
Dimers associate into a tetramer to form the enzymatically active phosphorylase A.
Residue:
847
  
Inhibitor
Name:
BDBM50158255
Synonyms:
5-Chloro-1H-indole-2-carboxylic acid {[cycloheptyl-(2-hydroxy-ethyl)-carbamoyl]-methyl}-amide | CHEMBL425526
Type:
Small organic molecule
Emp. Form.:
C20H26ClN3O3
Mol. Mass.:
391.892
SMILES:
OCCN(C1CCCCCC1)C(=O)CNC(=O)c1cc2cc(Cl)ccc2[nH]1
: