Target
Rho-associated protein kinase 2
Ligand
BDBM14027
Substrate
Meas. Tech.
ChEMBL_2185240 (CHEMBL5097322)
IC50
158±n/a nM
Citation
 Lee, SKim, JJo, JChang, JWSim, JYun, H Recent advances in development of hetero-bivalent kinase inhibitors. Eur J Med Chem 216:0 (2021) Target
Name:
Rho-associated protein kinase 2
Synonyms:
KIAA0619 ROCK2 Rho kinase 2 (ROCKII) Rho-associated protein kinase 2 (ROCK2) Rho-associated protein kinase 2/Transforming protein RhoA Rho-associated, coiled-coil-containing protein kinase II p164 ROCK-2
Type:
Protein
Mol. Mass.:
160885.43
Organism:
Homo sapiens (Human)
Description:
O75116
Residue:
1388
  
Inhibitor
Name:
BDBM14027
Synonyms:
5-(1,4-diazepan-1-ylsulfonyl)isoquinoline AT877 CHEMBL541388 HA-1077 cid_163751
Type:
Small organic molecule
Emp. Form.:
C14H17N3O2S
Mol. Mass.:
291.369
SMILES:
O=S(=O)(N1CCCNCC1)c1cccc2cnccc12
: