Target
Cytochrome P450 2C19
Ligand
BDBM50158458
Substrate
Meas. Tech.
ChEMBL_430467 (CHEMBL916311)
Ki
33±n/a nM
Citation
 Locuson, CWSuzuki, HRettie, AEJones, JP Charge and substituent effects on affinity and metabolism of benzbromarone-based CYP2C19 inhibitors. J Med Chem 47:6768-76 (2004)  
Target
Name:
Cytochrome P450 2C19
Synonyms:
(R)-limonene 6-monooxygenase (S)-limonene 7-monooxygenase CYP2C19 CYPIIC19 Cytochrome P450 2C19 [I331V] Cytochrome P450-254C Mephenytoin 4-hydroxylase P450-254C
Type:
Enzyme
Mol. Mass.:
55935.47
Organism:
Homo sapiens (Human)
Description:
P33261
Residue:
490
  
Inhibitor
Name:
BDBM50158458
Synonyms:
(2-ethylbenzofuran-3-yl)(4-hydroxy-3,5-dimethylphenyl)methanone | CHEMBL225481
Type:
Small organic molecule
Emp. Form.:
C19H18O3
Mol. Mass.:
294.3444
SMILES:
CCc1oc2ccccc2c1C(=O)c1cc(C)c(O)c(C)c1
: