Target
Cytochrome P450 2C19
Ligand
BDBM50158468
Substrate
Meas. Tech.
ChEMBL_430467 (CHEMBL916311)
Ki
13000±n/a nM
Citation
 Locuson, CWSuzuki, HRettie, AEJones, JP Charge and substituent effects on affinity and metabolism of benzbromarone-based CYP2C19 inhibitors. J Med Chem 47:6768-76 (2004)  
Target
Name:
Cytochrome P450 2C19
Synonyms:
(R)-limonene 6-monooxygenase (S)-limonene 7-monooxygenase CYP2C19 CYPIIC19 Cytochrome P450 2C19 [I331V] Cytochrome P450-254C Mephenytoin 4-hydroxylase P450-254C
Type:
Enzyme
Mol. Mass.:
55935.47
Organism:
Homo sapiens (Human)
Description:
P33261
Residue:
490
  
Inhibitor
Name:
BDBM50158468
Synonyms:
CHEMBL390613 | cyclohexyl(2-methylbenzofuran-3-yl)methanone
Type:
Small organic molecule
Emp. Form.:
C16H18O2
Mol. Mass.:
242.3129
SMILES:
Cc1oc2ccccc2c1C(=O)C1CCCCC1
: