Target
MAP kinase-interacting serine/threonine-protein kinase 2
Ligand
BDBM50587870
Substrate
Meas. Tech.
ChEMBL_2185554 (CHEMBL5097636)
Ki
40±n/a nM
Citation
 Jin, XYu, RWang, XProud, CGJiang, T Progress in developing MNK inhibitors. Eur J Med Chem 219:0 (2021) Target
Name:
MAP kinase-interacting serine/threonine-protein kinase 2
Synonyms:
GPRK7 MAP kinase-interacting serine/threonine-protein kinase 2 (MKNK2) MAP-kinase interacting kinase 2 (MNK2) MKNK2_HUMAN | MNK2
Type:
Protein
Mol. Mass.:
51870.79
Organism:
Homo sapiens (Human)
Description:
Q9HBH9
Residue:
465
  
Inhibitor
Name:
BDBM50587870
Synonyms:
CHEMBL5173114
Type:
Small organic molecule
Emp. Form.:
C13H10N6
Mol. Mass.:
250.2587
SMILES:
Nc1cccc2n(ncc12)-c1ncnc2[nH]ccc12
: