Target
Phenylethanolamine N-methyltransferase
Ligand
BDBM13017
Substrate
Meas. Tech.
ChEMBL_303174 (CHEMBL829668)
Ki
280±n/a nM
Citation
 Grunewald, GLRomero, FACriscione, KR 3-hydroxymethyl-7-(N-substituted aminosulfonyl)-1,2,3,4-tetrahydroisoquinoline inhibitors of phenylethanolamine N-methyltransferase that display remarkable potency and selectivity. J Med Chem 48:134-40 (2005)  
Target
Name:
Phenylethanolamine N-methyltransferase
Synonyms:
Noradrenaline N-methyltransferase PNMT PNMTase | Phenylethanolamine N-Methyltransferase (PNMT)
Type:
Enzyme
Mol. Mass.:
30852.66
Organism:
Homo sapiens (Human)
Description:
Residue:
282
  
Inhibitor
Name:
BDBM13017
Synonyms:
1,2,3,4-tetrahydroisoquinoline-7-sulfonamide SKF 29661
Type:
Small organic molecule
Emp. Form.:
C9H12N2O2S
Mol. Mass.:
212.269
SMILES:
NS(=O)(=O)c1ccc2CCNCc2c1
: