Target
Calcium/calmodulin-dependent protein kinase type II subunit alpha
Ligand
BDBM50588634
Substrate
Meas. Tech.
ChEMBL_2187906 (CHEMBL5099988)
Ki
56.0±n/a nM
Citation
 Tian, YShehata, MAGauger, SJVeronesi, CHamborg, LThiesen, LBruus-Jensen, JRoyssen, JSLeurs, ULarsen, ASGKrall, JSolbak, SMØWellendorph, PFrølund, B Exploring the NCS-382 Scaffold for CaMKII? Modulation: Synthesis, Biochemical Pharmacology, and Biophysical Characterization of Ph-HTBA as a Novel High-Affinity Brain-Penetrant Stabilizer of the CaMKII? Hub Domain. J Med Chem 65:15066-15084 (2022) Target
Name:
Calcium/calmodulin-dependent protein kinase type II subunit alpha
Synonyms:
CaM Kinase II Camk2a calcium/calmodulin-dependent protein kinase II alpha subunit
Type:
Enzyme Mixture
Mol. Mass.:
54120.65
Organism:
Rattus norvegicus (rat)
Description:
Consists of subunits of M.W. 50,000 and 58,000-60,000 in a 3:1 ratio.
Residue:
478
  
Inhibitor
Name:
BDBM50588634
Synonyms:
CHEMBL5182530
Type:
Small organic molecule
Emp. Form.:
C21H22O3
Mol. Mass.:
322.3976
SMILES:
OC1c2cccc(CCc3ccccc3)c2CCC\C1=C/C(O)=O
: