Target
Carbonic anhydrase 5A, mitochondrial
Ligand
BDBM50159796
Substrate
Meas. Tech.
ChEMBL_302604 (CHEMBL838571)
Ki
1620000±n/a nM
Citation
 Innocenti, AVullo, DScozzafava, ACasey, JRSupuran, C Carbonic anhydrase inhibitors. Interaction of isozymes I, II, IV, V, and IX with carboxylates. Bioorg Med Chem Lett 15:573-8 (2005)  
Target
Name:
Carbonic anhydrase 5A, mitochondrial
Synonyms:
CA-VA CA5A Carbonate dehydratase VA Carbonic anhydrase 5A (CA VA) Carbonic anhydrase 5A, mitochondrial precursor Carbonic anhydrase VA (CA VA)
Type:
Enzyme
Mol. Mass.:
34755.54
Organism:
Homo sapiens (Human)
Description:
Human (cloned) isozyme
Residue:
305
  
Inhibitor
Name:
BDBM50159796
Synonyms:
2,3,5,6-F4-Benzoate Sodium; 2,3,5,6-tetrafluoro-benzoate | sodium 2,3,5,6-tetrafluorobenzoate
Type:
Small organic molecule
Emp. Form.:
C7HF4O2
Mol. Mass.:
193.0758
SMILES:
[O-]C(=O)c1c(F)c(F)cc(F)c1F
: