Target
Metabotropic glutamate receptor 5
Ligand
BDBM50160627
Substrate
Meas. Tech.
ChEMBL_303616 (CHEMBL828871)
Ki
6.5±n/a nM
Citation
 Alagille, DBaldwin, RMRoth, BLWroblewski, JTGrajkowska, ETamagnan, GD Functionalization at position 3 of the phenyl ring of the potent mGluR5 noncompetitive antagonists MPEP. Bioorg Med Chem Lett 15:945-9 (2005)  
Target
Name:
Metabotropic glutamate receptor 5
Synonyms:
GRM5_RAT Grm5 Mglur5 metabotropic glutamate 5/1-C metabotropic glutamate 5a
Type:
Enzyme
Mol. Mass.:
131900.14
Organism:
Rattus norvegicus (Rat)
Description:
P31424
Residue:
1203
  
Inhibitor
Name:
BDBM50160627
Synonyms:
2-{[5-(2-furyl)pyridin-3-yl]ethynyl}-6-methylpyridine | CHEMBL360773
Type:
Small organic molecule
Emp. Form.:
C17H12N2O
Mol. Mass.:
260.29
SMILES:
Cc1cccc(n1)C#Cc1cncc(c1)-c1ccco1
: