Target
D(2) dopamine receptor
Ligand
BDBM50160810
Substrate
Meas. Tech.
ChEMBL_303342 (CHEMBL840158)
Ki
11.9±n/a nM
Citation
 Ochi, TSakamoto, MMinamida, ASuzuki, KUeda, TUne, TToda, HMatsumoto, KTerauchi, Y Syntheses and properties of the major hydroxy metabolites in humans of blonanserin AD-5423, a novel antipsychotic agent. Bioorg Med Chem Lett 15:1055-9 (2005)  
Target
Name:
D(2) dopamine receptor
Synonyms:
D(2) dopamine receptor DOPAMINE D2 Long DRD2 Dopamine D2 receptor Dopamine D2 receptor (D2R) Dopamine2-like | d2
Type:
Cell-surface receptors
Mol. Mass.:
50647.10
Organism:
Homo sapiens (Human)
Description:
P14416
Residue:
443
  
Inhibitor
Name:
BDBM50160810
Synonyms:
(S)-4-(4-Fluoro-phenyl)-2-(4-propyl-piperazin-1-yl)-5,6,7,8,9,10-hexahydro-cycloocta[b]pyridin-8-ol | CHEMBL179649
Type:
Small organic molecule
Emp. Form.:
C23H30FN3O
Mol. Mass.:
383.5022
SMILES:
CCN1CCN(CC1)c1cc(-c2ccc(F)cc2)c2CCC[C@H](O)CCc2n1
: