Target
5-hydroxytryptamine receptor 2A
Ligand
BDBM50161626
Substrate
Meas. Tech.
ChEMBL_310684 (CHEMBL837403)
EC50
63±n/a nM
Citation
 Smith, BMSmith, JMTsai, JHSchultz, JAGilson, CAEstrada, SAChen, RRPark, DMPrieto, EBGallardo, CSSengupta, DThomsen, WJSaldana, HRWhelan, KTMenzaghi, FWebb, RRBeeley, NR Discovery and SAR of new benzazepines as potent and selective 5-HT(2C) receptor agonists for the treatment of obesity. Bioorg Med Chem Lett 15:1467-70 (2005)  
Target
Name:
5-hydroxytryptamine receptor 2A
Synonyms:
5-HT-2 5-HT2A 5-hydroxytryptamine receptor 2A (5HT-2A) 5HT2A_HUMAN HTR2A | Serotonin receptor 2A
Type:
undefined
Mol. Mass.:
52607.65
Organism:
Homo sapiens (Human)
Description:
P28223
Residue:
471
  
Inhibitor
Name:
BDBM50161626
Synonyms:
8-Bromo-1-methyl-2,3,4,5-tetrahydro-1H-benzo[d]azepin-7-ol | CHEMBL178313
Type:
Small organic molecule
Emp. Form.:
C11H14BrNO
Mol. Mass.:
256.139
SMILES:
CC1CNCCc2cc(O)c(Br)cc12
: