Target
5-hydroxytryptamine receptor 2C
Ligand
BDBM50161643
Substrate
Meas. Tech.
ChEMBL_310683 (CHEMBL837402)
EC50
2±n/a nM
Citation
 Smith, BMSmith, JMTsai, JHSchultz, JAGilson, CAEstrada, SAChen, RRPark, DMPrieto, EBGallardo, CSSengupta, DThomsen, WJSaldana, HRWhelan, KTMenzaghi, FWebb, RRBeeley, NR Discovery and SAR of new benzazepines as potent and selective 5-HT(2C) receptor agonists for the treatment of obesity. Bioorg Med Chem Lett 15:1467-70 (2005)  
Target
Name:
5-hydroxytryptamine receptor 2C
Synonyms:
5-HT-1C 5-HT1C 5-HT2C-INI 5-HTR2C 5-hydroxytryptamine receptor 2C (5-HT-2C) 5HT-1C HTR1C Serotonin (5-HT3) receptor Serotonin Receptor 2C
Type:
G Protein-Coupled Receptor (GPCR)
Mol. Mass.:
51836.79
Organism:
Homo sapiens (Human)
Description:
P28335
Residue:
458
  
Inhibitor
Name:
BDBM50161643
Synonyms:
8-Iodo-7-methoxy-1-methyl-2,3,4,5-tetrahydro-1H-benzo[d]azepine | CHEMBL179378
Type:
Small organic molecule
Emp. Form.:
C12H16INO
Mol. Mass.:
317.166
SMILES:
COc1cc2CCNCC(C)c2cc1I
: