Target
5-hydroxytryptamine receptor 2B
Ligand
BDBM50161619
Substrate
Meas. Tech.
ChEMBL_310685 (CHEMBL837404)
EC50
130±n/a nM
Citation
 Smith, BMSmith, JMTsai, JHSchultz, JAGilson, CAEstrada, SAChen, RRPark, DMPrieto, EBGallardo, CSSengupta, DThomsen, WJSaldana, HRWhelan, KTMenzaghi, FWebb, RRBeeley, NR Discovery and SAR of new benzazepines as potent and selective 5-HT(2C) receptor agonists for the treatment of obesity. Bioorg Med Chem Lett 15:1467-70 (2005)  
Target
Name:
5-hydroxytryptamine receptor 2B
Synonyms:
5-HT-2B 5-hydroxytryptamine (serotonin) receptor 2B [Homo sapiens] 5-hydroxytryptamine receptor 2C (5HT2C) HTR2B Serotonin 2b (5-HT2b) receptor | Serotonin Receptor 2B
Type:
G Protein-Coupled Receptor (GPCR)
Mol. Mass.:
54312.47
Organism:
Homo sapiens (Human)
Description:
Receptor binding assays were performed using human clone stably expressed in CHO cells.
Residue:
481
  
Inhibitor
Name:
BDBM50161619
Synonyms:
7-Methoxy-1-methyl-8-trifluoromethyl-2,3,4,5-tetrahydro-1H-benzo[d]azepine | CHEMBL179915
Type:
Small organic molecule
Emp. Form.:
C13H16F3NO
Mol. Mass.:
259.2674
SMILES:
COc1cc2CCNCC(C)c2cc1C(F)(F)F
: