Target
Dihydrofolate reductase
Ligand
BDBM50066488
Substrate
Meas. Tech.
ChEMBL_305729 (CHEMBL829401)
IC50
5400±n/a nM
Citation
 Gangjee, ALin, X CoMFA and CoMSIA analyses of Pneumocystis carinii dihydrofolate reductase, Toxoplasma gondii dihydrofolate reductase, and rat liver dihydrofolate reductase. J Med Chem 48:1448-69 (2005)  
Target
Name:
Dihydrofolate reductase
Synonyms:
DYR_PNECA Dihydrofolate reductase Tetrahydrofolate dehydrogenase
Type:
Enzyme
Mol. Mass.:
23891.29
Organism:
Pneumocystis carinii
Description:
Residue:
206
  
Inhibitor
Name:
BDBM50066488
Synonyms:
CHEMBL114833 | N*6*-(2,4,5-Trimethoxy-benzyl)-quinazoline-2,4,6-triamine
Type:
Small organic molecule
Emp. Form.:
C18H21N5O3
Mol. Mass.:
355.391
SMILES:
COc1cc(OC)c(OC)cc1CNc1ccc2nc(N)nc(N)c2c1
: