Target
5-hydroxytryptamine receptor 2A
Ligand
BDBM50113332
Substrate
Meas. Tech.
ChEMBL_2197441 (CHEMBL5109957)
Ki
0.130000±n/a nM
Citation
 Fu, HRong, JChen, ZZhou, JCollier, TLiang, SH Positron Emission Tomography (PET) Imaging Tracers for Serotonin Receptors. J Med Chem 65:10755-10808 (2022) Target
Name:
5-hydroxytryptamine receptor 2A
Synonyms:
5-HT-2A 5-HT2A 5-hydroxytryptamine receptor 2A (5HT2A) Htr2 Serotonin Receptor 2A
Type:
G Protein-Coupled Receptor (GPCR)
Mol. Mass.:
52852.05
Organism:
Rattus norvegicus (rat)
Description:
Rat cortex membranes 5-HT2A receptors.
Residue:
471
  
Inhibitor
Name:
BDBM50113332
Synonyms:
3-(2-(4-(4-fluorobenzoyl)piperidin-1-yl)ethyl)-2-thioxo-2,3-dihydroquinazolin-4(1H)-one CHEMBL62919 | altanserin
Type:
Small organic molecule
Emp. Form.:
C22H22FN3O2S
Mol. Mass.:
411.492
SMILES:
Fc1ccc(cc1)C(=O)C1CCN(CCn2c(=S)[nH]c3ccccc3c2=O)CC1
: