Target
Epidermal growth factor receptor
Ligand
BDBM50591176
Substrate
Meas. Tech.
ChEMBL_2199529 (CHEMBL5112045)
EC50
20±n/a nM
Citation
 Xu, FZhang, XChen, ZHe, SGuo, JYu, LWang, YHou, CAi-Furas, HZheng, ZSmaill, JBPatterson, AVZhang, ZMChen, LRen, XDing, K Discovery of Isoform-Selective Akt3 Degraders Overcoming Osimertinib-Induced Resistance in Non-Small Cell Lung Cancer Cells. J Med Chem 65:14032-14048 (2022) Target
Name:
Epidermal growth factor receptor
Synonyms:
EGF Receptor Substrate EGFR_HUMAN ERBB1 Epidermal Growth Factor Receptor erbB-1 Epidermal growth factor receptor (EGFR) HER1 Proto-oncogene c-ErbB-1 Tyrosine-Protein Kinase ErbB-1
Type:
Receptor Kinase Domain
Mol. Mass.:
134279.59
Organism:
Homo sapiens (Human)
Description:
P00533
Residue:
1210
  
Inhibitor
Name:
BDBM50591176
Synonyms:
CHEMBL5183997
Type:
Small organic molecule
Emp. Form.:
C52H70N8O4
Mol. Mass.:
871.1634
SMILES:
COc1cc(ccc1Nc1ncc2c(C)cc(=O)n(-c3cccc(NC(=O)C=C)c3)c2n1)N1CCN(CCCCCCCCCCCCNC(=O)CC23CC4CC(CC(C4)C2)C3)CC1
: