Target
Histone deacetylase 1
Ligand
BDBM50368352
Substrate
Meas. Tech.
ChEMBL_2200947 (CHEMBL5113655)
IC50
47±n/a nM
Citation
 Vaidya, GNRana, PVenkatesh, AChatterjee, DRContractor, DSatpute, DPNagpure, MJain, AKumar, D Paradigm shift of "classical" HDAC inhibitors to "hybrid" HDAC inhibitors in therapeutic interventions. Eur J Med Chem 209:0 (2021) Target
Name:
Histone deacetylase 1
Synonyms:
Cereblon/Histone deacetylase 1 HDAC1 Histone deacetylase 1 (HDAC1) RPD3L1
Type:
Enzyme
Mol. Mass.:
55090.27
Organism:
Homo sapiens (Human)
Description:
Q13547
Residue:
482
  
Inhibitor
Name:
BDBM50368352
Synonyms:
Cerubidine | DAUNORUBICIN
Type:
Small organic molecule
Emp. Form.:
C27H29NO10
Mol. Mass.:
527.5199
SMILES:
COc1cccc2C(=O)c3c(O)c4C[C@](O)(C[C@H](O[C@H]5C[C@H](N)[C@H](O)[C@H](C)O5)c4c(O)c3C(=O)c12)C(C)=O
: