Target
5-hydroxytryptamine receptor 1A
Ligand
BDBM50164344
Substrate
Meas. Tech.
ChEMBL_303435 (CHEMBL839604)
Ki
558.5±n/a nM
Citation
 Patanè, EPittalà, VGuerrera, FSalerno, LRomeo, GSiracusa, MARusso, FManetti, FBotta, MMereghetti, ICagnotto, AMennini, T Synthesis of 3-arylpiperazinylalkylpyrrolo[3,2-d]pyrimidine-2,4-dione derivatives as novel, potent, and selective alpha1-adrenoceptor ligands. J Med Chem 48:2420-31 (2005)  
Target
Name:
5-hydroxytryptamine receptor 1A
Synonyms:
5-HT-1A 5-HT1A 5-hydroxytryptamine receptor 1A (5HT1A) 5ht1a Htr1a Serotonin 1a (5-HT1a) receptor/Adrenergic receptor alpha-1 | Serotonin receptor 1A
Type:
G Protein-Coupled Receptor (GPCR)
Mol. Mass.:
46445.29
Organism:
Rattus norvegicus (rat)
Description:
Binding assays were performed using rat hippocampal membranes.
Residue:
422
  
Inhibitor
Name:
BDBM50164344
Synonyms:
3-{2-[4-(2-Chloro-phenyl)-piperazin-1-yl]-ethyl}-1,5-dihydro-pyrrolo[3,2-d]pyrimidine-2,4-dione | CHEMBL190384
Type:
Small organic molecule
Emp. Form.:
C18H20ClN5O2
Mol. Mass.:
373.837
SMILES:
Clc1ccccc1N1CCN(CCn2c(=O)[nH]c3cc[nH]c3c2=O)CC1
: