Target
D(2) dopamine receptor
Ligand
BDBM50164344
Substrate
Meas. Tech.
ChEMBL_303249 (CHEMBL827214)
Ki
322.1±n/a nM
Citation
 Patanè, EPittalà, VGuerrera, FSalerno, LRomeo, GSiracusa, MARusso, FManetti, FBotta, MMereghetti, ICagnotto, AMennini, T Synthesis of 3-arylpiperazinylalkylpyrrolo[3,2-d]pyrimidine-2,4-dione derivatives as novel, potent, and selective alpha1-adrenoceptor ligands. J Med Chem 48:2420-31 (2005)  
Target
Name:
D(2) dopamine receptor
Synonyms:
DOPAMINE D2 DOPAMINE D2 Short Dopamine D2 receptor Drd2
Type:
G Protein-Coupled Receptor (GPCR)
Mol. Mass.:
50931.60
Organism:
Rattus norvegicus (rat)
Description:
P61169
Residue:
444
  
Inhibitor
Name:
BDBM50164344
Synonyms:
3-{2-[4-(2-Chloro-phenyl)-piperazin-1-yl]-ethyl}-1,5-dihydro-pyrrolo[3,2-d]pyrimidine-2,4-dione | CHEMBL190384
Type:
Small organic molecule
Emp. Form.:
C18H20ClN5O2
Mol. Mass.:
373.837
SMILES:
Clc1ccccc1N1CCN(CCn2c(=O)[nH]c3cc[nH]c3c2=O)CC1
: