Target
Lysophosphatidic acid receptor 3
Ligand
BDBM50166115
Substrate
Meas. Tech.
ChEMBL_304392 (CHEMBL830042)
EC50
>10000±n/a nM
Citation
 Xu, YAoki, JShimizu, KUmezu-Goto, MHama, KTakanezawa, YYu, SMills, GBArai, HQian, LPrestwich, GD Structure-activity relationships of fluorinated lysophosphatidic acid analogues. J Med Chem 48:3319-27 (2005)  
Target
Name:
Lysophosphatidic acid receptor 3
Synonyms:
EDG7 LPAR3 Lysophosphatidic acid receptor 1/3 Lysophosphatidic acid receptor Edg-7
Type:
Enzyme
Mol. Mass.:
40149.72
Organism:
Homo sapiens (Human)
Description:
Q9UBY5
Residue:
353
  
Inhibitor
Name:
BDBM50166115
Synonyms:
CHEMBL190876 | PALMITOYL
Type:
Small organic molecule
Emp. Form.:
C19H38O7P
Mol. Mass.:
409.4751
SMILES:
CCCCCCCCCCCCCCCC(=O)OCC(O)COP(O)([O-])=O
: