Target
Lysophosphatidic acid receptor 3
Ligand
BDBM50166118
Substrate
Meas. Tech.
ChEMBL_304392 (CHEMBL830042)
EC50
>10000±n/a nM
Citation
 Xu, YAoki, JShimizu, KUmezu-Goto, MHama, KTakanezawa, YYu, SMills, GBArai, HQian, LPrestwich, GD Structure-activity relationships of fluorinated lysophosphatidic acid analogues. J Med Chem 48:3319-27 (2005)  
Target
Name:
Lysophosphatidic acid receptor 3
Synonyms:
EDG7 LPAR3 Lysophosphatidic acid receptor 1/3 Lysophosphatidic acid receptor Edg-7
Type:
Enzyme
Mol. Mass.:
40149.72
Organism:
Homo sapiens (Human)
Description:
Q9UBY5
Residue:
353
  
Inhibitor
Name:
BDBM50166118
Synonyms:
CHEMBL195383 | Hexadecanoic acid (R)-2,2-difluoro-1-phosphonooxymethyl-ethyl ester
Type:
Small organic molecule
Emp. Form.:
C19H37F2O6P
Mol. Mass.:
430.464
SMILES:
CCCCCCCCCCCCCCCC(=O)O[C@H](COP(O)(O)=O)C(F)F
: