Target
Alpha-2A adrenergic receptor
Ligand
BDBM50166560
Substrate
Meas. Tech.
ChEMBL_306656 (CHEMBL831429)
IC50
110±n/a nM
Citation
 Kanuma, KOmodera, KNishiguchi, MFunakoshi, TChaki, SSemple, GTran, TAKramer, BHsu, DCasper, MThomsen, BBeeley, NSekiguchi, Y Discovery of 4-(dimethylamino)quinazolines as potent and selective antagonists for the melanin-concentrating hormone receptor 1. Bioorg Med Chem Lett 15:2565-9 (2005)  
Target
Name:
Alpha-2A adrenergic receptor
Synonyms:
ADA2A_HUMAN ADRA2R Adrenergic alpha2A Alpha-2 adrenergic receptor subtype C10 Alpha-2A adrenoreceptor alpha-2A adrenergic receptor [Homo sapiens]
Type:
Enzyme
Mol. Mass.:
48979.91
Organism:
Homo sapiens (Human)
Description:
P08913
Residue:
465
  
Inhibitor
Name:
BDBM50166560
Synonyms:
4-Bromo-N-[4-(4-dimethylamino-quinazolin-2-ylamino)-cyclohexylmethyl]-2-trifluoromethoxy-benzenesulfonamide | CHEMBL194602
Type:
Small organic molecule
Emp. Form.:
C24H27BrF3N5O3S
Mol. Mass.:
602.467
SMILES:
CN(C)c1nc(NC2CCC(CNS(=O)(=O)c3ccc(Br)cc3OC(F)(F)F)CC2)nc2ccccc12
: