Target
Fibroblast growth factor receptor 1/2/3/4
Ligand
BDBM50168394
Substrate
Meas. Tech.
ChEMBL_312234 (CHEMBL825076)
IC50
1±n/a nM
Citation
 Borzilleri, RMZheng, XQian, LEllis, CCai, ZWWautlet, BSMortillo, SJeyaseelan, RKukral, DWFura, AKamath, AVyas, VTokarski, JSBarrish, JCHunt, JTLombardo, LJFargnoli, JBhide, RS Design, synthesis, and evaluation of orally active 4-(2,4-difluoro-5-(methoxycarbamoyl)phenylamino)pyrrolo[2,1-f][1,2,4]triazines as dual vascular endothelial growth factor receptor-2 and fibroblast growth factor receptor-1 inhibitors. J Med Chem 48:3991-4008 (2005)  
Target
Name:
Fibroblast growth factor receptor 1/2/3/4
Synonyms:
Fibroblast growth factor receptor
Type:
Mol. Mass.:
Description:
ASSAY_ID of ChEMBL is 2101620
Components:
This complex has 4 components.
Component 1
Name:
Fibroblast growth factor receptor 3
Synonyms:
CD_antigen: CD333 FGFR3 Fibroblast growth factor receptor JTK4
Type:
Protein
Mol. Mass.:
87699.57
Organism:
Homo sapiens (Human)
Description:
P22607
Residue:
806
  
Component 2
Name:
Fibroblast growth factor receptor 1
Synonyms:
BFGFR Basic fibroblast growth factor receptor 1 (FGFR1) CEK FGFR-1 FGFR-1, (FL) FGFR1_HUMAN FLT2 Fibroblast growth factor receptor 1 (FGFR-1) Fms-like tyrosine kinase 2 N-sam bFGF-R | c-fgr
Type:
Receptor
Mol. Mass.:
91861.70
Organism:
Homo sapiens (Human)
Description:
P11362
Residue:
822
  
Component 3
Name:
Fibroblast growth factor receptor 4
Synonyms:
CD_antigen: CD334 FGFR4 FGFR4 Fibroblast growth factor receptor JK2 TKF
Type:
Protein
Mol. Mass.:
87957.45
Organism:
Homo sapiens (Human)
Description:
P22455
Residue:
802
  
Component 4
Name:
Fibroblast growth factor receptor 2
Synonyms:
BEK FGFR-2 FGFR2 Fibroblast growth factor receptor 2 (FGFR2) KGFR Keratinocyte growth factor receptor VEGF-receptor 2 and Fibroblast growth factor receptor 2
Type:
Enzyme
Mol. Mass.:
92015.45
Organism:
Homo sapiens (Human)
Description:
P21802
Residue:
821
  
Inhibitor
Name:
BDBM50168394
Synonyms:
2,4-Difluoro-5-[5-isopropyl-6-(5-isopropyl-[1,3,4]oxadiazol-2-yl)-pyrrolo[2,1-f][1,2,4]triazin-4-ylamino]-N-methoxy-benzamide | CHEMBL373365
Type:
Small organic molecule
Emp. Form.:
C22H23F2N7O3
Mol. Mass.:
471.4599
SMILES:
CONC(=O)c1cc(Nc2ncnn3cc(-c4nnc(o4)C(C)C)c(C(C)C)c23)c(F)cc1F
: