Target
Amine oxidase [flavin-containing] B
Ligand
BDBM50355323
Substrate
Meas. Tech.
ChEMBL_2213736 (CHEMBL5126868)
IC50
308±n/a nM
Citation
 Saini, APatel, RGaba, SSingh, GGupta, GDMonga, V Adenosine receptor antagonists: Recent advances and therapeutic perspective. Eur J Med Chem 227:0 (2022) Target
Name:
Amine oxidase [flavin-containing] B
Synonyms:
AOFB_HUMAN MAOB Monoamine oxidase type B (MAO B) Monoamine oxidase type B (MAOB)
Type:
Protein
Mol. Mass.:
58768.76
Organism:
Homo sapiens (Human)
Description:
P27338
Residue:
520
  
Inhibitor
Name:
BDBM50355323
Synonyms:
CHEMBL1835228
Type:
Small organic molecule
Emp. Form.:
C17H14O2
Mol. Mass.:
250.2919
SMILES:
Cc1ccc(cc1)-c1cc2cc(C)ccc2oc1=O
: