Target
Melanin-concentrating hormone receptor 1
Ligand
BDBM50168612
Substrate
Meas. Tech.
ChEMBL_303766 (CHEMBL829988)
Ki
3400±n/a nM
Citation
 Rowbottom, MWVickers, TDDyck, BTamiya, JZhang, MZhao, LGrey, JProvencal, DSchwarz, DHeise, CEMistry, MFisher, ADong, THu, TSaunders, JGoodfellow, VS Synthesis and structure-activity relationships of biarylcarboxamide bis-aminopyrrolidine urea derived small-molecule antagonists of the melanin-concentrating hormone receptor-1 (MCH-R1). Bioorg Med Chem Lett 15:3439-45 (2005)  
Target
Name:
Melanin-concentrating hormone receptor 1
Synonyms:
G-protein coupled receptor 24 MCH receptor 1 MCH-R1 MCHR-1 MCHR1_HUMAN Melanin-Concentrating Hormone Receptor 1 (MCH1R) Melanin-concentrating hormone receptor 1 (MCH-1) Melanin-concentrating hormone receptor 1 (MCHR-1) SLC-1 Somatostatin receptor-like protein
Type:
G Protein-Coupled Receptor (GPCR)
Mol. Mass.:
45976.27
Organism:
Homo sapiens (Human)
Description:
Membranes from CHO-K1 cells stably expressing human MCH1R were used in assays.
Residue:
422
  
Inhibitor
Name:
BDBM50168612
Synonyms:
(S)-3-{[5-(2-Methoxy-phenyl)-thiophene-2-carbonyl]-methyl-amino}-pyrrolidine-1-carboxylic acid methyl-((R)-1-methyl-pyrrolidin-3-yl)-amide | CHEMBL363876
Type:
Small organic molecule
Emp. Form.:
C24H32N4O3S
Mol. Mass.:
456.601
SMILES:
COc1ccccc1-c1ccc(s1)C(=O)N(C)[C@H]1CCN(C1)C(=O)N(C)[C@@H]1CCN(C)C1
: