Target
Melanin-concentrating hormone receptor 1
Ligand
BDBM50168635
Substrate
Meas. Tech.
ChEMBL_303766 (CHEMBL829988)
Ki
3±n/a nM
Citation
 Rowbottom, MWVickers, TDDyck, BTamiya, JZhang, MZhao, LGrey, JProvencal, DSchwarz, DHeise, CEMistry, MFisher, ADong, THu, TSaunders, JGoodfellow, VS Synthesis and structure-activity relationships of biarylcarboxamide bis-aminopyrrolidine urea derived small-molecule antagonists of the melanin-concentrating hormone receptor-1 (MCH-R1). Bioorg Med Chem Lett 15:3439-45 (2005)  
Target
Name:
Melanin-concentrating hormone receptor 1
Synonyms:
G-protein coupled receptor 24 MCH receptor 1 MCH-R1 MCHR-1 MCHR1_HUMAN Melanin-Concentrating Hormone Receptor 1 (MCH1R) Melanin-concentrating hormone receptor 1 (MCH-1) Melanin-concentrating hormone receptor 1 (MCHR-1) SLC-1 Somatostatin receptor-like protein
Type:
G Protein-Coupled Receptor (GPCR)
Mol. Mass.:
45976.27
Organism:
Homo sapiens (Human)
Description:
Membranes from CHO-K1 cells stably expressing human MCH1R were used in assays.
Residue:
422
  
Inhibitor
Name:
BDBM50168635
Synonyms:
(S)-3-{[5-(4-Methoxy-2-methyl-phenyl)-thiophene-2-carbonyl]-methyl-amino}-pyrrolidine-1-carboxylic acid methyl-((R)-1-methyl-pyrrolidin-3-yl)-amide | CHEMBL189756
Type:
Small organic molecule
Emp. Form.:
C25H34N4O3S
Mol. Mass.:
470.627
SMILES:
COc1ccc(-c2ccc(s2)C(=O)N(C)[C@H]2CCN(C2)C(=O)N(C)[C@@H]2CCN(C)C2)c(C)c1
: